Articles of gradle

Ошибка: Неожиданный протокол блокировки, найденный в файле блокировки. Ожидаемое 3, найдено 0

После обновления Android Studio до версии 1.3 я больше не могу скомпилировать свой проект. Я получаю Unexpected lock protocol found in lock file. Expected 3, found 0. Unexpected lock protocol found in lock file. Expected 3, found 0. .. Я попытался удалить мою папку .gradle но это не решает проблему. Что-нибудь еще я могу сделать?

Добавление зависимости kSOAP к проекту Gradle

Я пытаюсь заставить kSOAP работать в моем Android-проекте с Gradle. Это файл build.gradle моего проекта: buildscript { repositories { mavenCentral() } dependencies { classpath 'com.android.tools.build:gradle:0.5.+' } } apply plugin: 'android' repositories { mavenCentral() maven { url 'http://ksoap2-android.googlecode.com/svn/m2-repo' } } android { compileSdkVersion 18 buildToolsVersion "18.0.1" defaultConfig { minSdkVersion 7 targetSdkVersion 18 } } dependencies { […]

Конфигурация Proguard для Android Support v4 22.2.0

После обновления зависимостей от Gradle Android build для использования com.android.support:support-v4:22.2.0 из локального хранилища репозитория Maven (в SDK) Proguard начал бросать эти проблемы. Warning: android.support.v4.app.DialogFragment: can't find referenced class android.support.v4.app.DialogFragment$DialogStyle Warning: android.support.v4.app.FragmentTransaction: can't find referenced class android.support.v4.app.FragmentTransaction$Transit Warning: android.support.v4.view.ViewCompat: can't find referenced class android.support.v4.view.ViewCompat$ResolvedLayoutDirectionMode Warning: android.support.v4.view.ViewCompat: can't find referenced class android.support.v4.view.ViewCompat$LayoutDirectionMode Warning: android.support.v4.view.ViewCompat: can't find referenced […]

При условии, что зависимость от грейдов AAR не JAR

У меня проблема, когда я пытаюсь включить библиотеку в свой проект под названием ParseLoginUI . Проблема в том, что вместо компиляции используется предоставленный тег. Я считаю, что предоставленный тег означает, что проект должен предоставлять эту зависимость, чтобы библиотека работала, а не эта библиотека, компилируя сами библиотеки. Поэтому в моей библиотеке Android он ссылается на SDK […]

Android 5.x ClassNotFoundException отлично работает на 6.0+

Я обновил minSdkVersion моего проекта с 19 до 21. Это вызвало проблему с устройствами 5.0 / 5.1, где я не могу запустить приложение. Я продолжаю получать ClassNotFoundException в своем классе приложения. Ниже приведены полный журнал, класс приложения и файл градиента. Если я верну свой проект обратно в minSdkVersion 19, тогда приложение будет работать на 4.4+ […]

Android Unit Tests – нет такого свойства: bootClasspath

Я пытаюсь выполнить простой тестовый пример для Android после только что объявленной поддержки модульного тестирования – http://tools.android.com/tech-docs/unit-testing-support После тщательного прохождения пошагового руководства я пытаюсь запустить ./gradlew test . Я получаю эту ошибку: Execution failed for task ':app:compileDebugGroovy'. > No such property: bootClasspath for class: com.android.build.gradle.AppPlugin Используя com.android.tools.build:gradle:1.1.0-rc1 . Кто-нибудь еще застрял на этом?

Андроид Gradle javadoc не существует

Я пытаюсь создать aar для публикации в jcenter. Задача assembleRelease работает нормально, задача javadoc также отлично работает, но задача javadocJar выводит эту ошибку: /Users/martinmoreno/Projects/android-dev-utils/dev-utils/src/main/java/com/tinchoapps/devutils/BitmapUtils.java:11: error: package android.support.annotation does not exist import android.support.annotation.NonNull; Вот (упрощенный) файл градиента: apply plugin: 'com.android.library' apply plugin: 'com.github.dcendents.android-maven' android { … buildTypes { release { minifyEnabled false shrinkResources false proguardFiles getDefaultProguardFile('proguard-android.txt'), […]

Студия Android / Gradle build не работает в выпуске: не удалось определить зависимости задачи: app: crashlyticsStoreDeobsRelease '

Сборка выходит из строя только в выпуске, отладочная сборка прекрасна. Android studio 1.4, Gradle 2.8 RC1, Gradle plugin 1.4.0 BETA 4 FAILURE: Build failed with an exception. * Exception is: org.gradle.api.GradleException: Could not determine the dependencies of task ':app:crashlyticsStoreDeobsRelease'. … Error:org.gradle.api.UnknownTaskException: Task with path 'dexRelease' not found in project ':app'.

Как работает новое приложение в build.gradle?

Google выпустила версию 0.11 плагина Android Gradle. Примечания к выпуску содержат следующее: Одним из видимых изменений пользователя в 0.11 является то, что мы устарели параметры packageName и packageNameSuffix и переименовали их в applicationId и applicationIdSuffix. Целью этого является дать понять, что этот идентификатор приложения отделен от деклараций пакетов в вашем манифестах, и в частности, класс […]

Не удалось найти com.google.android.gms: play-services: 7.3.0

У меня есть этот журнал из Android Studio gradle: Error:A problem occurred configuring project ':ParseStarterProject'. > Could not resolve all dependencies for configuration ':ParseStarterProject:_debugCompile'. > Could not find com.google.android.gms:play-services:7.5.0. Searched in the following locations: https://repo1.maven.org/maven2/com/google/android/gms/play-services/7.5.0/play-services-7.5.0.pom https://repo1.maven.org/maven2/com/google/android/gms/play-services/7.5.0/play-services-7.5.0.jar Required by: Parse:ParseStarterProject:unspecified Как в мире он не может выглядеть локально там, где он (другие проекты четко видят и […]