Intereting Posts
Добавьте непрозрачную «тень» (контур) в Android TextView Android LinearLayout Gradient Background Курсор Edittext сбрасывается налево после обновления привязки данных Android Как я могу заставить сайт масштабироваться для исправления для мобильных устройств (Iphone android ..) Получение android.content.res.Resources $ NotFoundException: исключение, даже если ресурс присутствует в android Значок плюс в плавающей кнопке действия Как я должен делать это с уведомлением до начала деятельности без новых намерений Не запрашивайте Window.FEATURE_ACTION_BAR и установите для windowActionBar значение false в вашей теме, чтобы вместо этого использовать панель инструментов Как преобразовать растровое изображение в эскиз карандаша в Android? Назначение сервиса Intent-Filter внутри Manifest.xml TabLayout отсутствует после обновления библиотеки поддержки дизайна SetAdapter "Для вызова требуется уровень API 11 (текущий мин – 8): android.widget.AbsListView # setAdapter"? Android Studio – SDK устарел или отсутствует шаблоны Библиотека поддержки дизайна Android TabLayout с использованием настраиваемых макетов вкладок, но макет, обертывающий вкладки Как сохранить Hashmap для Android, чтобы он был повторно использован при перезапуске приложения с использованием общих настроек?

Не удается создать проект Android с помощью Android Studio – Gradle 1.7

У меня много проблем с Gradle и Android Studio.

Внесение изменений в любой ресурс в проекте может случайным образом давать исключение во время компиляции, это то, что я вижу в Android Studio:

Gradle: Error while executing aapt command Gradle: Execution failed for task ':App Code:processReleaseResources'. 

И это то, что я вижу, выполняя Gradle вручную:

 "/Applications/Android Studio.app/sdk/tools/templates/gradle/wrapper/gradlew" asD Relying on packaging to define the extension of the main artifact has been deprecated and is scheduled to be removed in Gradle 2.0 :App Code:preBuild UP-TO-DATE :App Code:preDebugBuild UP-TO-DATE :App Code:preReleaseBuild UP-TO-DATE :libraries:facebook:compileLint :libraries:facebook:copyReleaseLint UP-TO-DATE :libraries:facebook:mergeReleaseProguardFiles UP-TO-DATE :libraries:facebook:packageReleaseAidl UP-TO-DATE :libraries:facebook:preBuild UP-TO-DATE :libraries:facebook:preReleaseBuild UP-TO-DATE :libraries:facebook:prepareReleaseDependencies :libraries:facebook:compileReleaseAidl UP-TO-DATE :libraries:facebook:compileReleaseRenderscript UP-TO-DATE :libraries:facebook:generateReleaseBuildConfig UP-TO-DATE :libraries:facebook:mergeReleaseAssets UP-TO-DATE :libraries:facebook:mergeReleaseResources UP-TO-DATE :libraries:facebook:processReleaseManifest UP-TO-DATE :libraries:facebook:processReleaseResources UP-TO-DATE :libraries:facebook:generateReleaseSources UP-TO-DATE :libraries:facebook:compileRelease UP-TO-DATE :libraries:facebook:processReleaseJavaRes UP-TO-DATE :libraries:facebook:packageReleaseJar UP-TO-DATE :libraries:facebook:packageReleaseLocalJar UP-TO-DATE :libraries:facebook:packageReleaseRenderscript UP-TO-DATE :libraries:facebook:packageReleaseResources UP-TO-DATE :libraries:facebook:bundleRelease UP-TO-DATE :App Code:prepareComAndroidSupportAppcompatV71800Library UP-TO-DATE :App Code:prepareComGoogleAndroidGmsPlayServices3136Library UP-TO-DATE :App Code:prepareLatestUpdateLibrariesFacebookUnspecifiedLibrary UP-TO-DATE :App Code:prepareDebugDependencies :App Code:compileDebugAidl :App Code:compileDebugRenderscript :App Code:generateDebugBuildConfig :App Code:mergeDebugAssets :App Code:mergeDebugResources :App Code:processDebugManifest :App Code:processDebugResources FAILED FAILURE: Build failed with an exception. * What went wrong: Execution failed for task ':App Code:processDebugResources'. > Failed to run command: /Applications/Android Studio.app/sdk/build-tools/android-4.2.2/aapt package -f --no-crunch -I /Applications/Android Studio.app/sdk/platforms/android-17/android.jar -M /Users/oslinux/Documents/workspace/Appme-android/latest-update/App Code/build/manifests/debug/AndroidManifest.xml -S /Users/oslinux/Documents/workspace/Appme-android/latest-update/App Code/build/res/all/debug -A /Users/oslinux/Documents/workspace/Appme-android/latest-update/App Code/build/assets/debug -m -J /Users/oslinux/Documents/workspace/Appme-android/latest-update/App Code/build/source/r/debug -F /Users/oslinux/Documents/workspace/Appme-android/latest-update/App Code/build/libs/App Code-debug.ap_ --debug-mode --custom-package com.floaty.App --output-text-symbols /Users/oslinux/Documents/workspace/Appme-android/latest-update/App Code/build/symbols/debug Error Code: 139 * Try: Run with --stacktrace option to get the stack trace. Run with --info or --debug option to get more log output. BUILD FAILED Total time: 20.268 secs host-005:App Code oslinux$ 

Выполнение Gradle с помощью –stacktrace – это выходное исключение:

  * Exception is: org.gradle.api.tasks.TaskExecutionException: Execution failed for task ':VMS Code:processDebugResources'. at org.gradle.api.internal.tasks.execution.ExecuteActionsTaskExecuter.executeActions(ExecuteActionsTaskExecuter.java:69) at org.gradle.api.internal.tasks.execution.ExecuteActionsTaskExecuter.execute(ExecuteActionsTaskExecuter.java:46) at org.gradle.api.internal.tasks.execution.PostExecutionAnalysisTaskExecuter.execute(PostExecutionAnalysisTaskExecuter.java:35) at org.gradle.api.internal.changedetection.state.CacheLockReleasingTaskExecuter$1.run(CacheLockReleasingTaskExecuter.java:35) at org.gradle.internal.Factories$1.create(Factories.java:22) at org.gradle.cache.internal.DefaultCacheAccess.longRunningOperation(DefaultCacheAccess.java:179) at org.gradle.cache.internal.DefaultCacheAccess.longRunningOperation(DefaultCacheAccess.java:232) at org.gradle.cache.internal.DefaultPersistentDirectoryStore.longRunningOperation(DefaultPersistentDirectoryStore.java:142) at org.gradle.api.internal.changedetection.state.DefaultTaskArtifactStateCacheAccess.longRunningOperation(DefaultTaskArtifactStateCacheAccess.java:83) at org.gradle.api.internal.changedetection.state.CacheLockReleasingTaskExecuter.execute(CacheLockReleasingTaskExecuter.java:33) at org.gradle.api.internal.tasks.execution.SkipUpToDateTaskExecuter.execute(SkipUpToDateTaskExecuter.java:58) at org.gradle.api.internal.tasks.execution.ContextualisingTaskExecuter.execute(ContextualisingTaskExecuter.java:34) at org.gradle.api.internal.changedetection.state.CacheLockAcquiringTaskExecuter$1.run(CacheLockAcquiringTaskExecuter.java:39) at org.gradle.internal.Factories$1.create(Factories.java:22) at org.gradle.cache.internal.DefaultCacheAccess.useCache(DefaultCacheAccess.java:124) at org.gradle.cache.internal.DefaultCacheAccess.useCache(DefaultCacheAccess.java:112) at org.gradle.cache.internal.DefaultPersistentDirectoryStore.useCache(DefaultPersistentDirectoryStore.java:134) at org.gradle.api.internal.changedetection.state.DefaultTaskArtifactStateCacheAccess.useCache(DefaultTaskArtifactStateCacheAccess.java:79) at org.gradle.api.internal.changedetection.state.CacheLockAcquiringTaskExecuter.execute(CacheLockAcquiringTaskExecuter.java:37) at org.gradle.api.internal.tasks.execution.ValidatingTaskExecuter.execute(ValidatingTaskExecuter.java:57) at org.gradle.api.internal.tasks.execution.SkipEmptySourceFilesTaskExecuter.execute(SkipEmptySourceFilesTaskExecuter.java:41) at org.gradle.api.internal.tasks.execution.SkipTaskWithNoActionsExecuter.execute(SkipTaskWithNoActionsExecuter.java:51) at org.gradle.api.internal.tasks.execution.SkipOnlyIfTaskExecuter.execute(SkipOnlyIfTaskExecuter.java:52) at org.gradle.api.internal.tasks.execution.ExecuteAtMostOnceTaskExecuter.execute(ExecuteAtMostOnceTaskExecuter.java:42) at org.gradle.api.internal.AbstractTask.executeWithoutThrowingTaskFailure(AbstractTask.java:282) at org.gradle.execution.taskgraph.DefaultTaskPlanExecutor.executeTask(DefaultTaskPlanExecutor.java:48) at org.gradle.execution.taskgraph.DefaultTaskPlanExecutor.processTask(DefaultTaskPlanExecutor.java:34) at org.gradle.execution.taskgraph.DefaultTaskPlanExecutor.process(DefaultTaskPlanExecutor.java:27) at org.gradle.execution.taskgraph.DefaultTaskGraphExecuter.execute(DefaultTaskGraphExecuter.java:89) at org.gradle.execution.SelectedTaskExecutionAction.execute(SelectedTaskExecutionAction.java:29) at org.gradle.execution.DefaultBuildExecuter.execute(DefaultBuildExecuter.java:61) at org.gradle.execution.DefaultBuildExecuter.access$200(DefaultBuildExecuter.java:23) at org.gradle.execution.DefaultBuildExecuter$2.proceed(DefaultBuildExecuter.java:67) at org.gradle.api.internal.changedetection.state.TaskCacheLockHandlingBuildExecuter$1.run(TaskCacheLockHandlingBuildExecuter.java:31) at org.gradle.internal.Factories$1.create(Factories.java:22) at org.gradle.cache.internal.DefaultCacheAccess.useCache(DefaultCacheAccess.java:124) at org.gradle.cache.internal.DefaultCacheAccess.useCache(DefaultCacheAccess.java:112) at org.gradle.cache.internal.DefaultPersistentDirectoryStore.useCache(DefaultPersistentDirectoryStore.java:134) at org.gradle.api.internal.changedetection.state.DefaultTaskArtifactStateCacheAccess.useCache(DefaultTaskArtifactStateCacheAccess.java:79) at org.gradle.api.internal.changedetection.state.TaskCacheLockHandlingBuildExecuter.execute(TaskCacheLockHandlingBuildExecuter.java:29) at org.gradle.execution.DefaultBuildExecuter.execute(DefaultBuildExecuter.java:61) at org.gradle.execution.DefaultBuildExecuter.access$200(DefaultBuildExecuter.java:23) at org.gradle.execution.DefaultBuildExecuter$2.proceed(DefaultBuildExecuter.java:67) at org.gradle.execution.DryRunBuildExecutionAction.execute(DryRunBuildExecutionAction.java:32) at org.gradle.execution.DefaultBuildExecuter.execute(DefaultBuildExecuter.java:61) at org.gradle.execution.DefaultBuildExecuter.execute(DefaultBuildExecuter.java:54) at org.gradle.initialization.DefaultGradleLauncher.doBuildStages(DefaultGradleLauncher.java:166) at org.gradle.initialization.DefaultGradleLauncher.doBuild(DefaultGradleLauncher.java:113) at org.gradle.initialization.DefaultGradleLauncher.run(DefaultGradleLauncher.java:81) at org.gradle.launcher.exec.InProcessBuildActionExecuter$DefaultBuildController.run(InProcessBuildActionExecuter.java:64) at org.gradle.launcher.cli.ExecuteBuildAction.run(ExecuteBuildAction.java:33) at org.gradle.launcher.cli.ExecuteBuildAction.run(ExecuteBuildAction.java:24) at org.gradle.launcher.exec.InProcessBuildActionExecuter.execute(InProcessBuildActionExecuter.java:35) at org.gradle.launcher.exec.InProcessBuildActionExecuter.execute(InProcessBuildActionExecuter.java:26) at org.gradle.launcher.cli.RunBuildAction.run(RunBuildAction.java:50) at org.gradle.api.internal.Actions$RunnableActionAdapter.execute(Actions.java:171) at org.gradle.launcher.cli.CommandLineActionFactory$ParseAndBuildAction.execute(CommandLineActionFactory.java:201) at org.gradle.launcher.cli.CommandLineActionFactory$ParseAndBuildAction.execute(CommandLineActionFactory.java:174) at org.gradle.launcher.cli.CommandLineActionFactory$WithLogging.execute(CommandLineActionFactory.java:170) at org.gradle.launcher.cli.CommandLineActionFactory$WithLogging.execute(CommandLineActionFactory.java:139) at org.gradle.launcher.cli.ExceptionReportingAction.execute(ExceptionReportingAction.java:33) at org.gradle.launcher.cli.ExceptionReportingAction.execute(ExceptionReportingAction.java:22) at org.gradle.launcher.Main.doAction(Main.java:48) at org.gradle.launcher.bootstrap.EntryPoint.run(EntryPoint.java:45) at org.gradle.launcher.Main.main(Main.java:39) at org.gradle.launcher.bootstrap.ProcessBootstrap.runNoExit(ProcessBootstrap.java:50) at org.gradle.launcher.bootstrap.ProcessBootstrap.run(ProcessBootstrap.java:32) at org.gradle.launcher.GradleMain.main(GradleMain.java:26) at org.gradle.wrapper.BootstrapMainStarter.start(BootstrapMainStarter.java:33) at org.gradle.wrapper.WrapperExecutor.execute(WrapperExecutor.java:130) at org.gradle.wrapper.GradleWrapperMain.main(GradleWrapperMain.java:48) Caused by: com.android.ide.common.internal.LoggedErrorException: Failed to run command: /Applications/Android Studio.app/sdk/build-tools/android-4.2.2/aapt package -f --no-crunch -I /Applications/Android Studio.app/sdk/platforms/android-17/android.jar -M /Users/oslinux/Documents/workspace/vmsme-android/latest-update/VMS Code/build/manifests/debug/AndroidManifest.xml -S /Users/oslinux/Documents/workspace/vmsme-android/latest-update/VMS Code/build/res/all/debug -A /Users/oslinux/Documents/workspace/vmsme-android/latest-update/VMS Code/build/assets/debug -m -J /Users/oslinux/Documents/workspace/vmsme-android/latest-update/VMS Code/build/source/r/debug -F /Users/oslinux/Documents/workspace/vmsme-android/latest-update/VMS Code/build/libs/VMS Code-debug.ap_ --debug-mode --custom-package com.floaty.vms --output-text-symbols /Users/oslinux/Documents/workspace/vmsme-android/latest-update/VMS Code/build/symbols/debug Error Code: 139 at com.android.ide.common.internal.CommandLineRunner.runCmdLine(CommandLineRunner.java:98) at com.android.ide.common.internal.CommandLineRunner.runCmdLine(CommandLineRunner.java:69) at com.android.builder.AndroidBuilder.processResources(AndroidBuilder.java:617) at com.android.builder.AndroidBuilder$processResources.call(Unknown Source) at com.android.build.gradle.tasks.ProcessAndroidResources.doFullTaskAction(ProcessAndroidResources.groovy:91) at com.android.build.gradle.internal.tasks.IncrementalTask.taskAction(IncrementalTask.groovy:71) at org.gradle.api.internal.BeanDynamicObject$MetaClassAdapter.invokeMethod(BeanDynamicObject.java:216) at org.gradle.api.internal.BeanDynamicObject.invokeMethod(BeanDynamicObject.java:122) at org.gradle.api.internal.CompositeDynamicObject.invokeMethod(CompositeDynamicObject.java:147) at com.android.build.gradle.tasks.ProcessAndroidResources_Decorated.invokeMethod(Unknown Source) at org.gradle.util.ReflectionUtil.invoke(ReflectionUtil.groovy:23) at org.gradle.api.internal.project.taskfactory.AnnotationProcessingTaskFactory$StandardTaskAction.doExecute(AnnotationProcessingTaskFactory.java:217) at org.gradle.api.internal.project.taskfactory.AnnotationProcessingTaskFactory$StandardTaskAction.execute(AnnotationProcessingTaskFactory.java:210) at org.gradle.api.internal.project.taskfactory.AnnotationProcessingTaskFactory$StandardTaskAction.execute(AnnotationProcessingTaskFactory.java:199) at org.gradle.api.internal.AbstractTask$TaskActionWrapper.execute(AbstractTask.java:526) at org.gradle.api.internal.AbstractTask$TaskActionWrapper.execute(AbstractTask.java:509) at org.gradle.api.internal.tasks.execution.ExecuteActionsTaskExecuter.executeAction(ExecuteActionsTaskExecuter.java:80) at org.gradle.api.internal.tasks.execution.ExecuteActionsTaskExecuter.executeActions(ExecuteActionsTaskExecuter.java:61) ... 70 more BUILD FAILED Total time: 14.276 secs host-005:VMS Code oslinux$ 

Я использую Android Studio 0.2.13

Как я могу решить эти проблемы?

EDIT: это мой build.gradle

 buildscript { repositories { mavenCentral() } dependencies { classpath 'com.android.tools.build:gradle:0.5.+' classpath 'com.newrelic.agent.android:agent-gradle-plugin:2.397.0' } } repositories { mavenCentral() maven { url 'http://www.bugsense.com/gradle/' } } apply plugin: 'android' apply plugin: 'newrelic' dependencies { compile 'com.newrelic.agent.android:android-agent:2.397' compile 'com.android.support:support-v4:18.0.+' compile 'com.android.support:appcompat-v7:18.0.+' compile 'com.intellij:annotations:12.+' compile 'com.bugsense.trace:bugsense:3.5' compile 'com.google.android.gms:play-services:3.1.+' compile 'net.hockeyapp.android:HockeySDK:3.0.+' compile fileTree(dir: 'libs', include: '*.jar') compile project(':libraries:facebook') } android { compileSdkVersion 17 buildToolsVersion "17.0.0" defaultConfig { minSdkVersion 8 targetSdkVersion 17 } signingConfigs { release { storeFile file("/Users/oslinux/Documents/Chiavi Android/Sv01") storePassword "******" keyAlias "sv01" keyPassword "******" } } buildTypes { release { signingConfig signingConfigs.release debuggable true jniDebugBuild false } } } 

ОБНОВИТЬ

Я попробовал вручную выполнить команду aapt, получив полную команду из сообщения об ошибке, в котором сглатываются градиенты, и не удалось:

 Segmentation fault: 11 

Но время от времени он работает правильно и создает пакет.

Не отображаются ошибки, кроме «Ошибка сегментации: 11».

Это команда, которую я пытаюсь выполнить:

 "/Applications/Android Studio.app/sdk/build-tools/android-4.2.2/aapt" package -vv -f -a --no-crunch -I "/Applications/Android Studio.app/sdk/platforms/android-17/android.jar" -M "/Users/oslinux/Documents/workspace/app-android/latest-update/App Code/build/manifests/release/AndroidManifest.xml" -S "/Users/oslinux/Documents/workspace/app-android/latest-update/App Code/build/res/all/release" -A "/Users/oslinux/Documents/workspace/app-android/latest-update/App Code/build/assets/release" -m -J "/Users/oslinux/Documents/workspace/app-android/latest-update/App Code/build/source/r/release" -F "/Users/oslinux/Documents/workspace/app-android/latest-update/App Code/build/libs/App Code-release.ap_" --debug-mode --custom-package com.appandroid.app --output-text-symbols "/Users/oslinux/Documents/workspace/app-android/latest-update/App Code/build/symbols/release" 

ЗАКЛЮЧИТЕЛЬНОЕ ОБНОВЛЕНИЕ

Похоже, я решил эту проблему, очистив свои ресурсы, удалив неиспользуемый XML и неиспользуемую тему. Это, очевидно, не отвечает на этот вопрос, который, на мой взгляд, представляет общий интерес.

Перемещение по сети я обнаружил, что AAPT знает, что сбой с SegFault11, и часто он не дает никакой информации о реальной ошибке, которая может быть вызвана:

  • + Id в стилях
  • Дублированные ресурсы / библиотеки
  • Неизвестно, как у меня

Поэтому было бы полезно: 1. Найти способ определить реальную причину этой ошибки. 2. Дождитесь обновления AAPT, которое вернет некоторое сообщение об ошибке 3. Напишите список возможных общих причин.

Solutions Collecting From Web of "Не удается создать проект Android с помощью Android Studio – Gradle 1.7"

Я копирую здесь свое последнее обновление в качестве ответа.

Похоже, я решил эту проблему, очистив свои ресурсы, удалив неиспользуемый XML и неиспользуемую тему. Это, очевидно, не отвечает на этот вопрос, который, на мой взгляд, представляет общий интерес.

Перемещение по сети я обнаружил, что AAPT знает, что сбой с SegFault11, и часто он не дает никакой информации о реальной ошибке, которая может быть вызвана:

  • Недостаточные ресурсы (Отсутствующие атрибуты, неправильные теги и т. Д.)
  • + Id в стилях
  • Дублированные ресурсы / библиотеки
  • Недопустимое имя Declare-Styleable
  • Недостаток ресурсов, попробуйте использовать разные версии AAPT.
  • Неизвестно, как и мое. Было бы полезно: 1. Найти способ определить реальную причину этой ошибки. 2. Подождите обновления AAPT, которая вернет некоторое сообщение об ошибке 3. Напишите список возможных общих причин.

Как предложил Дейл Купер , вы также можете попытаться запустить Lint и посмотреть, не обнаружено ли какое-либо предупреждение о ресурсах.

Я пытаюсь найти ссылки на пользователей, испытывающих эти другие причины (прошло некоторое время с оригинального вопроса), я обновлю этот ответ, когда верну их.

У меня была processDebugResources та же проблема, но на этапе processDebugResources . Через пару часов я начал пытаться запускать различные версии aapt (/ build-tools / [version] / aapt), и оказывается, что они дают одни адские сообщения об ошибках. Тот, который я изначально использовал, был 19.0.1 который только дал мне Segmentation fault но когда я опробовал 18.1.1 я неожиданно указал на строку в menu.xml которого была пропускная способность ресурса. Проблема заключается в том, что я удалил default @string/action_settings потому что думал, что не использовал его.

Вывод , попытка разных версий aapt может помочь вам найти ресурс missmatch.

Да, я просто боролся с подобной проблемой. Оказалось, что у меня есть некоторый незавершенный код в файле menu.xml:

  <item android:id="@+id/action_search" android:title="@string/action_search" android:icon="@drawable/" app:showAsAction="ifRoom|collapseActionView" /> 

Точно этой строке не хватало ссылочной ссылки:

  android:icon="@drawable/" 

Я нашел его через запуск Lint (Analyze -> Inspect code), и он был в Android -> Проверка ресурсов Android, поскольку Cannot resolve symbol '@drawable/'

У меня была такая же проблема, и ее было очень сложно найти.

Я хочу поделиться шагами, которые я сделал, чтобы найти и решить эту проблему.

Мой вывод градиента выглядит следующим образом:

 FAILURE: Build failed with an exception. * What went wrong: Execution failed for task ':libs:base:processDebugResources'. > com.android.ide.common.internal.LoggedErrorException: Failed to run command: /opt/android-sdk/build-tools/18.1.1/aapt package -f --no-crunch -I /opt/android-sdk/platforms/android-19/android.jar -M /home/m039/WorkProjects/libs/base/build/bundles/debug/AndroidManifest.xml -S /home/m039/WorkProjects/libs/base/build/res/all/debug -A /home/m039/WorkProjects/libs/base/build/bundles/debug/assets -m -J /home/m039/WorkProjects/libs/base/build/source/r/debug -F /home/m039/WorkProjects/libs/base/build/libs/base-debug.ap_ --debug-mode --non-constant-id --output-text-symbols /home/m039/WorkProjects/libs/base/build/bundles/debug Error Code: 139 

Прежде всего, я перешел на версию 18.1.1, это не помогло. Затем я попытался добавить флаг -v и запустить эту команду:

 /opt/android-sdk/build-tools/18.1.1/aapt package -f --no-crunch -I /opt/android-sdk/platforms/android-19/android.jar -M /home/m039/WorkProjects/libs/base/build/bundles/debug/AndroidManifest.xml -S /home/m039/WorkProjects/libs/base/build/res/all/debug -A /home/m039/WorkProjects/libs/base/build/bundles/debug/assets -m -J /home/m039/WorkProjects/libs/base/build/source/r/debug -F /home/m039/WorkProjects/libs/base/build/libs/base-debug.ap_ --debug-mode --non-constant-id --output-text-symbols /home/m039/WorkProjects/libs/base/build/bundles/debug -v 

Это помогло немного, но не давало понятия о проблеме. Затем я попробовал strace и это очень помогло:

 strace -s 100 /opt/android-sdk/build-tools/18.1.1/aapt package -f --no-crunch -I /opt/android-sdk/platforms/android-19/android.jar -M /home/m039/WorkProjects/libs/base/build/bundles/debug/AndroidManifest.xml -S /home/m039/WorkProjects/libs/base/build/res/all/debug -A /home/m039/WorkProjects/libs/base/build/bundles/debug/assets -m -J /home/m039/WorkProjects/libs/base/build/source/r/debug -F /home/m039/WorkProjects/libs/base/build/libs/base-debug.ap_ --debug-mode --non-constant-id --output-text-symbols /home/m039/WorkProjects/libs/base/build/bundles/debug 

В выводе предыдущей команды я нашел эту строку:

 open("/home/m039/WorkProjects/libs/base/build/res/all/debug/values/values.xml", O_RDONLY|O_LARGEFILE) = 5 

В файле values.xml я нашел все ресурсы, затем я начал удалять тег по тегу с конца файла и выполнить команду aapt выше, пока не aapt проблему.

Моя проблема была в ресурсе id.

У меня возникла проблема после импорта проекта eclipse. Проблема была с моей стороны. В eclipse я помещал png-изображение в drawable, которое было фактически jpg-изображением (я просто переименовал расширение с .jpg на .png). Он отлично работал с eclipse, но был неудачным при импорте в Android Studio.

Выполнение не выполнено для задачи ': app: mergeDebugResources'. Crunching Cruncher d.png не удалось

Я просто удалил d.png и добавил оригинальный png-файл. Это сработало!

Если вы импортировали проект из Eclipse, то в студии Android удалите меню ресурсов / main.xml и убедитесь, что у вас нет недопустимых строковых ресурсов.

По какой-то причине град не может проверить файл menu / main.xml.

Я удалил случайно добавленный заголовок в меню xml:

Удали это:

 <?xml version="1.0" encoding="utf-8"?> 

Оставь это:

 <menu xmlns:android="http://schemas.android.com/apk/res/android" > 

Поэтому, поскольку у меня была аналогичная проблема, я хотел бы опубликовать свое решение: после этой ошибки:

 failed to capture snapshot of output files for task… 

Я очистил свой проект, и он снова работал. Почему у меня нет подсказки, но это сработало. 🙂

Это случилось со мной для Activity, объявленного в манифесте, название которого было удалено из строкового файла.

Эта ошибка может быть любой, связанной с ресурсами. Лучший способ найти ошибку:

  1. Сохраните свой код.
  2. Вернитесь к последнему зафиксированному результату.
  3. Добавьте свои изменения ресурсов один за другим, пока не сработает снова.

У меня был подобный вопрос. Я предполагаю, что это обычно происходит, когда есть какой-то неполный тег или что-то в xml или какая-то некорректная … В моем случае проблема была в теме. В дизайне в студии android в моем xml-файле .. я выбрал новую тему … таким образом, она разрешила проблемы … надеюсь, что это поможет всем …