Обновление для Android Studio 3.0 Canary 2 дает ошибки сборки

Сегодня я обновил свою Studio до Canary 2 и возникла странная ошибка сборки:

Information:Gradle tasks [:app:generateDebugSources, :app:generateDebugAndroidTestSources, :app:mockableAndroidJar, :multipicker:generateDebugSources, :multipicker:generateDebugAndroidTestSources, :multipicker:mockableAndroidJar] Information:0 errors Information:0 warnings Information:See complete output in console Error:/home/master/AndroidStudioProjects/Reweyou/app/build/intermediates/incremental/mergeDebugResources/merged.dir/values/values.xml:795 invalid drawable Error:java.lang.RuntimeException: java.lang.RuntimeException: com.android.builder.internal.aapt.AaptException: AAPT2 compile failed: Error:Execution failed for task ':app:mergeDebugResources'. > Error: java.lang.RuntimeException: java.lang.RuntimeException: com.android.builder.internal.aapt.AaptException: AAPT2 compile failed: aapt2 compile -o /home/master/AndroidStudioProjects/Reweyou/app/build/intermediates/res/merged/debug /home/master/AndroidStudioProjects/Reweyou/app/build/intermediates/incremental/mergeDebugResources/merged.dir/values/values.xml Issues: - ERROR: /home/master/AndroidStudioProjects/Reweyou/app/build/intermediates/incremental/mergeDebugResources/merged.dir/values/values.xml:795 invalid drawable Information:BUILD FAILED in 11s 

Solutions Collecting From Web of "Обновление для Android Studio 3.0 Canary 2 дает ошибки сборки"

Мне удалось запустить Android Studio 3 Canary 2 с Gradle 3.0.0-alpha2 на основе этого ответа: https://stackoverflow.com/a/44202755/3936723

Я использую Linux, и для меня это решило проблему:

  1. Открытый терминал
  2. Тип: export LC_NUMERIC="en_US.UTF-8" sh ./android-studio/bin/studio.sh

–OLD ОТВЕТ–

Он будет работать в Android Studio 3.0 Canary, если вы измените Gradle на

 classpath 'com.android.tools.build:gradle:2.3.2' 

У меня такая же ошибка с версией com.android.tools.build:gradle:3.0.0-alpha2 , откат назад к предыдущей версии Gradle исправляет проблему для меня.

К сожалению, с более старым плагином gradle я не могу использовать расширенные опции в профилировщике Android 🙁

Решение было предоставлено здесь .

Вам необходимо изменить региональный формат вашего ПК для чисел на тот, который использует точку в виде десятичной метки, например, английский США / Великобритания.

Android Studio Canary 2 изменяет Gradle на com.android.tools.build:gradle:3.0.0-alpha2

Обходной путь возвращается к com.android.tools.build:gradle:3.0.0-alpha1